{"text_format":"1","workbook":"xlsx","n_sheets":7,"sheets":["Setting","Branches","Products","Stocks Inventory","Delivery_List","OrderFrm_Manual","Adjustment Order Frm"],"not_rendered":{"charts":0,"images":3,"macros":1,"external_links":0,"defined_names":51,"comments":3,"pivot_tables":0},"unopened":[],"bounds":{"document_bytes":16777216,"sheet_cells":100000,"rows_first":2000,"rows_last":500,"rows_between":2000,"halvings":0,"cell_chars":16384,"cell_head_chars":4096},"cells_cut":0,"cells_raw":0,"read":"whole","date_system":"1900"}

{"sheet":"Setting","index":0,"n_rows":17,"n_cols":7,"rows_kept":17,"cut":false,"hidden":false,"merged":[[3,2,3,4],[13,3,14,3],[6,6,7,6],[1,3,1,5],[1,6,1,7]]}
[]
[null,null,null,"::: GOLD BREAD INVENTORY SYSTEM Ver.01_2018",null,null,"Powered By IT-TEAM"]
[]
[null,null,"::: ENTER BUSINESS INFORMATION :::"]
[]
[]
[null,null,null,"ข้อมูลพื้นฐานประจำสาขา",null,null,"MENU"]
[]
[null,null,null,"รหัสสาขา"]
[null,null,null,"10-SK",null,null,"PRODUCTS"]
{"$rows_left_out":8}
{"sheet":"Branches","index":1,"n_rows":46,"n_cols":17,"rows_kept":46,"cut":false,"hidden":false,"merged":[[2,1,2,8]]}
[]
[null,null,null,null,null,"SETTING","STOCK","PRODUCTS","TRANSACTION"]
[null,":: Branches ::   (Update : 24-12-2022)",null,null,null,null,null,null,null,null,null,"Van_Route",null,null,"Data","Google Sheet Url","Edit Url"]
[null,null,null,null,null,null,null,null,null,null,null,null,null,null,null,null,{"$f":"SUBSTITUTE($P4,\"edit#\",\"export?format=csv&\")","v":""}]
[null,"Code","Thai_Name","Address","Manager","Regional Manager","Tel","Latitude","Longtitude","Route",null,"Route_Code",null,null,"Branches","https://docs.google.com/spreadsheets/d/1I3ev80bppMdCSDw2pa7WeDeY4CGlOrJw25FuykTCmRo/edit#gid=0","https://docs.google.com/spreadsheets/d/1I3ev80bppMdCSDw2pa7WeDeY4CGlOrJw25FuykTCmRo/export?format=csv&gid=0"]
[null,"00-FRY","โรงงานระยอง","115/1 ม.8 ต.ชากบก อ.บ้านค่าย จ.ระยอง 21120","นรรฆวุฒิ จันทฤทธิ์","","089-201-7562","12.774569","101.326649","",null,"FRY",null,null,"Products","https://docs.google.com/spreadsheets/d/1I3ev80bppMdCSDw2pa7WeDeY4CGlOrJw25FuykTCmRo/edit#gid=885289288","https://docs.google.com/spreadsheets/d/1I3ev80bppMdCSDw2pa7WeDeY4CGlOrJw25FuykTCmRo/export?format=csv&gid=885289288"]
[null,"00-FRK","โรงงานร่มเกล้า","205/5 ถ.ร่มเกล้า แขวงคลองสามประเวศ เขตลาดกระบัง กรุงเทพมหานคร 10520","นุกูล ปัญญานาค","","084-132-1000","13.7406423","100.7469429","",null,"FRK"]
[null,"00-FPT","โรงงานปทุมธานี","ต.คลองสี่ อ.คลองหลวง จ.ปทุมธานี 12120","พชรพล สุขสำราญ","นายอรรคพล มุ่งรวยกลาง","","14.079286","100.696028","",null,"FPT"]
[null,"03-KB","กบินทร์บุรี","262-263 ต.เมืองเก่า อ.กบินทร์บุรี จ.ปราจีนบุรี 25240","นายเจร ดวงอุประ","นายวุฒิพงศ์ ชาตรี","065-9405203","14.014677","101.773387","10",null,{"$f":"RIGHT(BranchCode,LEN(BranchCode)-FIND(\"-\",BranchCode))&TEXT(ROW(A1),\"00\")","v":"SK01"}]
[null,"04-KR","โคราช","1216 ถ.มหาวิทยาลัย1 ต.หนองจะบก อ.เมือง จ.นครราชสีมา 30000","นายกิตติศักดิ์ แก้วพะลัก","นายประสาร รู้การนา","065-9405204","14.902849","102.056995","12",null,"SK02"]
{"$rows_left_out":37}
{"sheet":"Products","index":2,"n_rows":55,"n_cols":29,"rows_kept":55,"cut":false,"hidden":false,"merged":[[3,1,3,8],[2,1,2,13],[2,22,2,23]]}
[]
[null,null,null,null,null,null,null,null,"SETTING","PRODUCTS","TRANSACTION","ORDER","REPORT",{"$f":"UPPER(\"Deliver List\")","v":"DELIVER LIST"}]
[null,"::: Product :::",null,null,null,null,null,null,null,null,null,null,null,null,null,null,"หน่วยนับสินค้า",null,"หมวดหมู่",null,"ประเภท",null,"Factory All Product List"]
[]
[null,"PD_Code","BarCode","NameTH","AccName","NameEng","Catagory","Waste_Option","Unit","Pcs/Unit","Case_Price","%Discount","Factory","Status",null,null,"Unit",null,"Catagories",null,"Type",null,"Order_Product_List","Adj_Product_List",null,"Month_List",null,null,"Calendar_List"]
[null,"9913","8852269400365","01-ขนมปังหมูหยองน้ำสลัด","ขนมปังหมูหยองน้ำสลัด","Shredded Pork Salad Cream Filled Bun 70g.","ของสด","YES","ชิ้น","40","20","45%","00-FRY","ปกติ",null,null,"ชิ้น",null,"ของสด",null,"รับ",null,{"$f":"IFERROR(INDEX($D$1:$D$70,_xlfn.AGGREGATE(15,6,ROW(GB_Product[NameTH])/((GB_Product[Status]=\"ปกติ\")*(GB_Product[Factory]=SL_Factory)),ROWS($6:6))),\"\")","v":"01-ขนมปังหมูหยองน้ำสลัด"},{"$f":"IFERROR(INDEX($D$1:$D$70,_xlfn.AGGREGATE(15,6,ROW(GB_Product[NameTH])/((GB_Product[Status]=\"ปกติ\")*(GB_Product[Factory]='Adjustment Order Frm'!SL_Factory)),ROWS($6:6))),\"\")","v":"01-ขนมปังหมูหยองน้ำสลัด"},null,"มกราคม","ม.ค.",null,{"$f":"DATE(YEAR(TODAY()),MONTH(TODAY()),ROWS($6:6)+DAY(TODAY())-8)","v":"2024-12-12"}]
[null,"99141","8852269590103","02-ขนมปังหมูหยองน้ำพริกเผา","ขนมปังหมูหยองน้ำพริกเผา","Shredded Pork Roasted Chili Paste Filled Bun 70g.","ของสด","YES","ชิ้น","40","20","45%","00-FRY","ปกติ",null,null,"ถาด",null,"ของแห้ง",null,"เบิก",null,{"$f":"IFERROR(INDEX($D$1:$D$70,_xlfn.AGGREGATE(15,6,ROW(GB_Product[NameTH])/((GB_Product[Status]=\"ปกติ\")*(GB_Product[Factory]=SL_Factory)),ROWS($6:7))),\"\")","v":"02-ขนมปังหมูหยองน้ำพริกเผา"},{"$f":"IFERROR(INDEX($D$1:$D$70,_xlfn.AGGREGATE(15,6,ROW(GB_Product[NameTH])/((GB_Product[Status]=\"ปกติ\")*(GB_Product[Factory]='Adjustment Order Frm'!SL_Factory)),ROWS($6:7))),\"\")","v":"02-ขนมปังหมูหยองน้ำพริกเผา"},null,"กุมภาพันธ์","ก.พ.",null,{"$f":"DATE(YEAR(TODAY()),MONTH(TODAY()),ROWS($6:7)+DAY(TODAY())-8)","v":"2024-12-13"}]
[null,"99126","8852269570013","03-ขนมปังไก่หยองน้ำสลัด","ขนมปังไก่หยองน้ำสลัด","Shredded Chicken Salad Cream Filled Bun 70g.","ของสด","YES","ชิ้น","40","20","45%","00-FRY","ปกติ",null,null,"กล่อง",null,null,null,"ยกมา",null,{"$f":"IFERROR(INDEX($D$1:$D$70,_xlfn.AGGREGATE(15,6,ROW(GB_Product[NameTH])/((GB_Product[Status]=\"ปกติ\")*(GB_Product[Factory]=SL_Factory)),ROWS($6:8))),\"\")","v":"03-ขนมปังไก่หยองน้ำสลัด"},{"$f":"IFERROR(INDEX($D$1:$D$70,_xlfn.AGGREGATE(15,6,ROW(GB_Product[NameTH])/((GB_Product[Status]=\"ปกติ\")*(GB_Product[Factory]='Adjustment Order Frm'!SL_Factory)),ROWS($6:8))),\"\")","v":"03-ขนมปังไก่หยองน้ำสลัด"},null,"มีนาคม","มี.ค.",null,{"$f":"DATE(YEAR(TODAY()),MONTH(TODAY()),ROWS($6:8)+DAY(TODAY())-8)","v":"2024-12-14"}]
[null,"99124","8852269401164","04-ขนมปังไส้ครีมสลัด","ขนมปังไส้ครีมสลัด","Salad Cream Filled Bun 70g.","ของสด","YES","ชิ้น","50","15","45%","00-FRY","ปกติ",null,null,"โหล",null,null,null,"เสีย",null,{"$f":"IFERROR(INDEX($D$1:$D$70,_xlfn.AGGREGATE(15,6,ROW(GB_Product[NameTH])/((GB_Product[Status]=\"ปกติ\")*(GB_Product[Factory]=SL_Factory)),ROWS($6:9))),\"\")","v":"04-ขนมปังไส้ครีมสลัด"},{"$f":"IFERROR(INDEX($D$1:$D$70,_xlfn.AGGREGATE(15,6,ROW(GB_Product[NameTH])/((GB_Product[Status]=\"ปกติ\")*(GB_Product[Factory]='Adjustment Order Frm'!SL_Factory)),ROWS($6:9))),\"\")","v":"04-ขนมปังไส้ครีมสลัด"},null,"เมษายน","เม.ย.",null,{"$f":"DATE(YEAR(TODAY()),MONTH(TODAY()),ROWS($6:9)+DAY(TODAY())-8)","v":"2024-12-15"}]
[null,"99142","8852269590110","05-ขนมปังเนยสด","ขนมปังเนยสด","Butter Cream Filled Bun 60g.","ของสด","YES","ชิ้น","40","15","45%","00-FRY","ปกติ",null,null,"แพ็ค",null,null,null,null,null,{"$f":"IFERROR(INDEX($D$1:$D$70,_xlfn.AGGREGATE(15,6,ROW(GB_Product[NameTH])/((GB_Product[Status]=\"ปกติ\")*(GB_Product[Factory]=SL_Factory)),ROWS($6:10))),\"\")","v":"05-ขนมปังเนยสด"},{"$f":"IFERROR(INDEX($D$1:$D$70,_xlfn.AGGREGATE(15,6,ROW(GB_Product[NameTH])/((GB_Product[Status]=\"ปกติ\")*(GB_Product[Factory]='Adjustment Order Frm'!SL_Factory)),ROWS($6:10))),\"\")","v":"05-ขนมปังเนยสด"},null,"พฤษภาคม","พ.ค.",null,{"$f":"DATE(YEAR(TODAY()),MONTH(TODAY()),ROWS($6:10)+DAY(TODAY())-8)","v":"2024-12-16"}]
{"$rows_left_out":46}
{"sheet":"Stocks Inventory","index":3,"n_rows":55,"n_cols":14,"rows_kept":55,"cut":false,"hidden":true,"merged":[[1,1,1,3],[1,4,1,6],[3,4,3,6],[11,12,11,13],[1,9,1,10],[3,9,4,9],[3,10,4,10]]}
[]
[null,"CHECK AVAILABILITY",null,null,"CHOOSE PRODUCT",null,null,null,null,"TODAY"]
[]
[null,null,null,null,"03-ขนมปังไส้ถั่วแดง",null,null,null,null,{"$f":"UPPER(TEXT(K4,\"MMM\"))","v":"ธ.ค."},{"$f":"TODAY()","v":"2024-12-19"}]
[null,null,null,"สต๊อคคงเหลือ (CURRENT INVENTORY)",{"$f":"INDEX(Stock[Stocks On Hand],MATCH($E$4,Stock[Products Name],0))","v":{"$error":"#N/A"}},null,null,{"$f":"INDEX(Stock[Unit],MATCH($E$4,Stock[Products Name],0))","v":{"$error":"#N/A"}}]
[null,null,null,"สต๊อคขั้นต่ำ (RE-ORDER POINT)",{"$f":"INDEX(Stock[Re-Order Point],MATCH($E$4,Stock[Products Name],0))","v":{"$error":"#N/A"}},null,null,{"$f":"INDEX(Stock[Unit],MATCH($E$4,Stock[Products Name],0))","v":{"$error":"#N/A"}}]
[null,null,null,"ยอดรับเข้า (RECEIVED QUANTITY)",{"$f":"INDEX(Stock[Received],MATCH($E$4,Stock[Products Name],0))","v":{"$error":"#N/A"}},null,null,{"$f":"INDEX(Stock[Unit],MATCH($E$4,Stock[Products Name],0))","v":{"$error":"#N/A"}}]
[null,null,null,"ยอดเบิกออก (DELIVERY QUANTITY)",{"$f":"INDEX(Stock[Deliver],MATCH($E$4,Stock[Products Name],0))","v":{"$error":"#N/A"}},null,null,{"$f":"INDEX(Stock[Unit],MATCH($E$4,Stock[Products Name],0))","v":{"$error":"#N/A"}}]
[]
[]
{"$rows_left_out":46}
{"sheet":"Delivery_List","index":4,"n_rows":52,"n_cols":45,"rows_kept":52,"cut":false,"hidden":true,"merged":[[50,39,50,40],[50,41,50,42],[4,8,5,9],[4,19,5,20],[4,30,5,31],[4,41,5,42],[47,39,47,40],[47,41,47,42],[48,35,48,36],[48,37,48,38],[49,35,49,36],[49,37,49,38],[49,41,49,42],[45,35,45,38],[46,35,46,38],[47,35,47,36],[47,37,47,38],[50,28,50,29],[50,30,50,31],[47,30,47,31],[48,24,48,25],[48,26,48,27],[49,24,49,25],[49,26,49,27],[2,35,2,40],[2,41,2,42],[4,35,4,36],[7,36,7,38],[7,40,7,42],[9,36,9,38],[10,36,10,38],[2,24,2,29],[2,30,2,31],[50,17,50,18],[50,19,50,20],[47,13,47,14],[47,15,47,16],[47,17,47,18],[47,19,47,20],[48,13,48,14],[48,15,48,16],[7,25,7,27],[9,25,9,27],[10,25,10,27],[45,13,45,16],[46,13,46,16],[2,19,2,20],[4,13,4,14],[49,30,49,31],[45,24,45,27],[46,24,46,27],[47,24,47,25],[47,26,47,27],[47,28,47,29],[4,24,4,25],[49,13,49,14],[49,15,49,16],[49,19,49,20],[7,29,7,31],[48,19,48,20],[7,3,7,5],[7,7,7,9],[49,2,49,3],[2,13,2,18],[7,14,7,16],[7,18,7,20],[9,14,9,16],[10,14,10,16],[47,6,47,7],[2,2,2,7],[2,8,2,9],[11,3,11,5],[4,2,4,3],[9,3,9,5],[10,3,10,5],[12,3,12,5],[13,3,13,5],[14,3,14,5],[15,3,15,5],[16,3,16,5],[17,3,17,5],[18,3,18,5],[19,3,19,5],[20,3,20,5],[50,6,50,7],[47,8,47,9],[50,8,50,9],[49,4,49,5],[46,2,46,5],[47,2,47,3],[48,2,48,3],[47,4,47,5],[48,4,48,5],[49,8,49,9],[48,8,48,9],[21,3,21,5],[22,3,22,5],[23,3,23,5],[24,3,24,5],[25,3,25,5],[26,3,26,5],[27,3,27,5],[28,3,28,5],[29,3,29,5],[48,41,48,42],[48,30,48,31],[45,2,45,5],[36,3,36,5],[41,3,41,5],[42,3,42,5],[43,3,43,5],[44,3,44,5],[30,3,30,5],[31,3,31,5],[32,3,32,5],[33,3,33,5],[34,3,34,5],[35,3,35,5],[37,3,37,5],[38,3,38,5],[39,3,39,5],[40,3,40,5]]}
[null,null,null,null,null,"SETTING","PRODUCTS","TRANSACTION","ORDER","REPORT"]
[null,null,null,null,null,null,null,null,null,null,null,null,null,null,null,null,null,null,null,null,null,null,null,null,null,null,null,null,null,null,null,null,null,null,null,null,null,null,null,null,null,null,null,null,{"$f":"\"\"","v":""}]
[null,null,"ใบเบิกสินค้าประจำสายวิ่งรายวัน\n(DAILY VAN ROUTE'S DELIVERY DETAILS)",null,null,null,null,null,"PC01",null,null,null,null,"ใบเบิกสินค้าประจำสายวิ่งรายวัน\n(DAILY VAN ROUTE'S DELIVERY DETAILS)",null,null,null,null,null,{"$f":"LEFT(Select_Route,FIND(\"0\",Select_Route))&RIGHT(Select_Route)+1","v":"PC02"},null,null,null,null,"ใบเบิกสินค้าประจำสายวิ่งรายวัน\n(DAILY VAN ROUTE'S DELIVERY DETAILS)",null,null,null,null,null,{"$f":"LEFT(Select_Route,FIND(\"0\",Select_Route))&RIGHT(Select_Route)+2","v":"PC03"},null,null,null,null,"ใบเบิกสินค้าประจำสายวิ่งรายวัน\n(DAILY VAN ROUTE'S DELIVERY DETAILS)",null,null,null,null,null,{"$f":"LEFT(Select_Route,FIND(\"0\",Select_Route))&RIGHT(Select_Route)+3","v":"PC04"},null,null,""]
[null,null,null,null,null,null,null,null,null,null,null,null,null,null,null,null,null,null,null,null,null,null,null,null,null,null,null,null,null,null,null,null,null,null,null,null,null,null,null,null,null,null,null,null,""]
[null,null,"วันที่ขอเบิก :",null,30,"ก.ค.",2018,null,{"$f":"TEXT(Delivery_List!Select_Date,\"[$-,107]dddd\")","v":"จันทร์"},null,null,null,null,"วันที่ขอเบิก :",null,{"$f":"$E$5","v":30},{"$f":"$F$5","v":"ก.ค."},{"$f":"$G$5","v":2018},null,{"$f":"$I$5","v":"จันทร์"},null,null,null,null,"วันที่ขอเบิก :",null,{"$f":"$E$5","v":30},{"$f":"$F$5","v":"ก.ค."},{"$f":"$G$5","v":2018},null,{"$f":"$I$5","v":"จันทร์"},null,null,null,null,"วันที่ขอเบิก :",null,{"$f":"$E$5","v":30},{"$f":"$F$5","v":"ก.ค."},{"$f":"$G$5","v":2018},null,{"$f":"$I$5","v":"จันทร์"},null,null,""]
[null,null,null,null,null,null,null,null,null,null,null,null,null,null,null,null,null,null,null,null,null,null,null,null,null,null,null,null,null,null,null,null,null,null,null,null,null,null,null,null,null,null,null,null,""]
[null,null,null,null,null,null,null,null,null,null,null,null,null,null,null,null,null,null,null,null,null,null,null,null,null,null,null,null,null,null,null,null,null,null,null,null,null,null,null,null,null,null,null,null,""]
[null,null,"พข.",null,null,null,"ผชข.",null,null,null,null,null,null,"พข.",null,null,null,"ผชข.",null,null,null,null,null,null,"พข.",null,null,null,"ผชข.",null,null,null,null,null,null,"พข.",null,null,null,"ผชข.",null,null,null,null,""]
[null,null,null,null,null,null,null,null,null,null,null,null,null,null,null,null,null,null,null,null,null,null,null,null,null,null,null,null,null,null,null,null,null,null,null,null,null,null,null,null,null,null,null,null,""]
[null,null,"ลำดับ","รายการ",null,null,"ยกมา","เบิก","เหลือ","เสีย",null,null,null,"ลำดับ","รายการ",null,null,"ยกมา","เบิก","เหลือ","เสีย",null,null,null,"ลำดับ","รายการ",null,null,"ยกมา","เบิก","เหลือ","เสีย",null,null,null,"ลำดับ","รายการ",null,null,"ยกมา","เบิก","เหลือ","เสีย",null,""]
{"$rows_left_out":43}
{"sheet":"OrderFrm_Manual","index":5,"n_rows":299,"n_cols":20,"rows_kept":299,"cut":false,"hidden":false,"merged":[[2,2,2,7],[58,1,58,2],[16,3,16,8],[8,7,8,8],[5,7,6,9],[7,7,7,9],[4,7,4,9]]}
[]
[null,null,null,null,null,"SETTING","PRODUCTS","STOCK","REPORT"]
[null,null,{"$f":"\"แบบฟอร์มใบขอเบิกสินค้าประจำสาขา\"&B_Name&\" (Product Order Form)\"","v":"แบบฟอร์มใบขอเบิกสินค้าประจำสาขาสมุทรปราการ (Product Order Form)"},null,null,null,null,null,"โรงงาน:","00-FRY"]
[]
[null,"เลขที่",{"$f":"\"PO_\"&MID(SL_Factory,4,3)&\"_\"&RIGHT(BranchCode,2)&\"-\"&TEXT(OrderDate,\"[$-107041e]yymmdd;@\")","v":"PO_FRY_SK-660724"},null,null,null,null,{"$f":"\"สาขา \"&B_Name","v":"สาขา สมุทรปราการ"}]
[null,null,null,null,null,null,null,{"$f":"IFERROR(\"เลขที่ \"&IFERROR(LEFT(B_Address,FIND(\"จ.\",B_Address)-1),LEFT(B_Address,FIND(\"แขวง\",B_Address)-1)),\"\")","v":"เลขที่ 155/6 ม.1 ต.บางพลีน้อย อ.บางบ่อ "}]
[]
[null,null,null,null,null,null,null,{"$f":"IF(B_Address=0,\"\",IFERROR(RIGHT(B_Address,LEN(B_Address)-FIND(\"จ.\",B_Address)+1),MID(B_Address,FIND(\"แขวง\",B_Address),FIND(\"กรุง\",B_Address)-FIND(\"แขวง\",B_Address))))","v":"จ.สมุทรปราการ 10560"}]
[null,null,null,null,null,null,null,{"$f":"IFERROR(IF(ISERROR(FIND(\"จ.\",B_Address)),RIGHT(B_Address,LEN(B_Address)-FIND(\"กรุงเทพ\",B_Address)+1),\"\"),\"\")","v":""}]
[null,null,null,null,2,"สิงหาคม","2023-01-22"]
{"$rows_left_out":290}
{"sheet":"Adjustment Order Frm","index":6,"n_rows":76,"n_cols":20,"rows_kept":76,"cut":false,"hidden":false,"merged":[[8,7,8,8],[2,2,2,6],[5,6,6,8],[4,6,4,8],[7,6,7,8],[17,6,17,8],[18,6,18,8],[19,6,19,8],[20,6,20,8],[16,4,16,5],[59,1,59,3],[41,6,41,8],[42,6,42,8],[43,6,43,8],[59,6,59,8],[58,6,58,8],[44,6,44,8],[52,6,52,8],[53,6,53,8],[54,6,54,8],[55,6,55,8],[56,6,56,8],[57,6,57,8],[34,6,34,8],[35,6,35,8],[39,6,39,8],[40,6,40,8],[36,6,36,8],[37,6,37,8],[38,6,38,8],[21,6,21,8],[22,6,22,8],[23,6,23,8],[24,6,24,8],[25,6,25,8],[33,6,33,8],[26,6,26,8],[29,6,29,8],[30,6,30,8],[31,6,31,8],[32,6,32,8],[27,6,27,8],[28,6,28,8]]}
[]
[null,null,null,null,"SETTING","PRODUCTS","STOCK","REPORT"]
[null,null,"แบบฟอร์มเพิ่ม-ลดสินค้าประจำสาขา ( Product Adjustment Order Form)",null,null,null,null,"โรงงาน:","00-FRY"]
[]
[null,"เลขที่",{"$f":"\"PO_ADJ_\"&MID(SL_Factory,4,3)&\"_\"&RIGHT(BranchCode,2)&\"-\"&TEXT(DATE(YEAR($G$10),MATCH($F$10,Month_List,0),E10),\"[$-107041e]yymmdd;@\")","v":"PO_ADJ_FRY_SK-660801"},null,null,null,{"$f":"\"สาขา \"&B_Name","v":"สาขา สมุทรปราการ"}]
[null,null,null,null,null,null,{"$f":"\"เลขที่ \"&IFERROR(LEFT(B_Address,FIND(\"จ.\",B_Address)-1),LEFT(B_Address,FIND(\"แขวง\",B_Address)-1))","v":"เลขที่ 155/6 ม.1 ต.บางพลีน้อย อ.บางบ่อ "}]
[]
[null,null,null,null,null,null,{"$f":"IFERROR(RIGHT(B_Address,LEN(B_Address)-FIND(\"จ.\",B_Address)+1),MID(B_Address,FIND(\"แขวง\",B_Address),FIND(\"กรุง\",B_Address)-FIND(\"แขวง\",B_Address)))","v":"จ.สมุทรปราการ 10560"}]
[null,null,null,null,null,null,null,{"$f":"IF(ISERROR(FIND(\"จ.\",B_Address)),RIGHT(B_Address,LEN(B_Address)-FIND(\"กรุงเทพ\",B_Address)+1),\"\")","v":""}]
[null,null,null,null,1,"สิงหาคม","2023-01-22"]
{"$rows_left_out":66}