{"text_format":"1","workbook":"xlsx","n_sheets":5,"sheets":["DataBase","BackPay","Employee","TimeScanAtt","Report"],"not_rendered":{"charts":0,"images":1,"macros":1,"external_links":0,"defined_names":61,"comments":2,"pivot_tables":0},"unopened":[],"bounds":{"document_bytes":16777216,"sheet_cells":100000,"rows_first":2000,"rows_last":500,"rows_between":2000,"halvings":0,"cell_chars":16384,"cell_head_chars":4096},"cells_cut":0,"cells_raw":0,"read":"whole","date_system":"1900"}

{"sheet":"DataBase","index":0,"n_rows":44,"n_cols":15,"rows_kept":44,"cut":false,"hidden":true,"merged":[[1,1,1,5]]}
[]
[null,"::: Branches :::",null,null,null,null,null,"Date Range",null,"Date_End",null,"IT Web Base",null,"Select Bank :","BBL"]
[null,null,null,null,null,null,null,null,null,null,null,null,null,"Bank Name","BankCode"]
[null,null,null,null,null,null,null,{"$f":"TODAY()-10+ROWS($4:4)","v":"2024-01-02"},null,{"$f":"StartDate+ROWS($4:4)","v":"2024-01-09"},null,"Employee >>",{"$f":"HYPERLINK(\"https://www.ncsgoldbread.com/HR/EmployeeWebExcel.php\",\"Employee\")","v":"Employee"},"ธนาคารกรุงเทพ (BBL)","BBL"]
[null,"Select :","33-PK",null,null,null,null,{"$f":"TODAY()-10+ROWS($4:5)","v":"2024-01-03"},null,{"$f":"StartDate+ROWS($4:5)","v":"2024-01-10"},null,"TimeScan >>",{"$f":"HYPERLINK(Web_TimeScan,\"TimeScan\")","v":"TimeScan"},"ธนาคารธนชาต (TNB)","TNB"]
[null,null,null,null,null,null,null,{"$f":"TODAY()-10+ROWS($4:6)","v":"2024-01-04"},null,{"$f":"StartDate+ROWS($4:6)","v":"2024-01-11"}]
[null,"Code","Thai_Name","Scanner","AlwRate","SunRate",null,{"$f":"TODAY()-10+ROWS($4:7)","v":"2024-01-05"},null,{"$f":"StartDate+ROWS($4:7)","v":"2024-01-12"}]
[null,"03-KB","กบินทร์บุรี","KB","1","5",null,{"$f":"TODAY()-10+ROWS($4:8)","v":"2024-01-06"},null,{"$f":"StartDate+ROWS($4:8)","v":"2024-01-13"},null,"กรณีพิเศษ",null,"Position","Alw Rate"]
[null,"04-KR","โคราช","KR","1","5",null,{"$f":"TODAY()-10+ROWS($4:9)","v":"2024-01-07"},null,{"$f":"StartDate+ROWS($4:9)","v":"2024-01-14"},null,"1) ขึ้นสายคนเดียว",null,"ตำแหน่งขาย",100]
[null,"05-NP","นครปฐม","NP","1","5",null,{"$f":"TODAY()-10+ROWS($4:10)","v":"2024-01-08"},null,null,null,"2) ช่วยต่างสาขา",null,"พนักงานขับรถ",150]
[null,"06-KK","ขอนแก่น","KK","1","5",null,{"$f":"TODAY()-10+ROWS($4:11)","v":"2024-01-09"},null,null,null,"3) ทำงานวันหยุดประจำปี"]
[null,"07-AY","อยุธยา","AY","1","5",null,{"$f":"TODAY()-10+ROWS($4:12)","v":"2024-01-10"},null,null,null,"4) กรณีพิเศษอื่นๆ"]
[null,"08-BK","กรุงเทพฯ","BK","1","5",null,{"$f":"TODAY()-10+ROWS($4:13)","v":"2024-01-11"},null,null,null,"5) ระงับการจ่าย"]
[null,"09-RY","ระยอง","FRY1","1","5",null,{"$f":"TODAY()-10+ROWS($4:14)","v":"2024-01-12"},null,null,null,"6) เคลียร์ยอดตกเบิก"]
[null,"10-SK","สมุทรปราการ","SK","1","5",null,{"$f":"TODAY()-10+ROWS($4:15)","v":"2024-01-13"}]
[null,"12-PY","พัทยา","PY","1","5",null,{"$f":"TODAY()-10+ROWS($4:16)","v":"2024-01-14"}]
[null,"13-SR","สุรินทร์","SR","1","5",null,{"$f":"TODAY()-10+ROWS($4:17)","v":"2024-01-15"}]
[null,"14-CB","จันทบุรี","CB","1","5",null,{"$f":"TODAY()-10+ROWS($4:18)","v":"2024-01-16"}]
[null,"15-UB","อุบลราชธานี","UB","1","5",null,{"$f":"TODAY()-10+ROWS($4:19)","v":"2024-01-17"}]
[null,"16-KL","คลองหลวง","KL","1","5",null,{"$f":"TODAY()-10+ROWS($4:20)","v":"2024-01-18"}]
{"$rows_left_out":25}
{"sheet":"BackPay","index":1,"n_rows":12,"n_cols":5,"rows_kept":12,"cut":false,"hidden":true,"merged":[[1,2,1,4]]}
[]
[null,"FilePath :",{"$f":"LEFT(CELL(\"filename\",A1),FIND(\"[\",CELL(\"filename\",A1))-1)&\"HR Report\"","v":"D:\\Acer\\GB_Update\\เบี้ยเลี้ยง\\Update\\HR Report"}]
[]
[null,"Date","Branch","EmpID","BackPay"]
[null,"2023-03-01","-","44986",100]
[null,"2023-03-01","05-NP","104305",100]
[null,"2023-03-01","-","44986",1050]
[null,"2023-03-01","26-LE","104296",1050]
[null,"2023-03-01","-","44986",500]
[null,"2023-03-01","31-KS","104291",500]
[null,"2023-03-01","-","44986",600]
[null,"2023-03-01","83-BRY","104297",600]

{"sheet":"Employee","index":2,"n_rows":685,"n_cols":21,"rows_kept":685,"cut":false,"hidden":true,"merged":[[1,1,1,4]]}
[]
[null,">> ฐานข้อมูลพนักงานฝ่ายขาย NCS-GOLDBREAD",null,null,null,{"$f":"COUNTA(Employee_Sales[Primary_ID])","v":681}]
[]
[null,"Primary_ID","Branch","ID Card","Employee Name","BBL_ACC","PosType","Starting Date","PosNum","Position",null,"Branch",null,"Branch","Employee Name","Position","PosNum"]
[null,"100184","03-KB","1801400005346","วัฒนา ใจห้าว","7227222796","ขาย","2008-04-19","5","พนักงานขาย",null,"03-KB",null,"03-KB","สุนทรีย์ โอสถานนท์","พนักงานบัญชี","3"]
[null,"101126","03-KB","3250200240695","นายศราวุธ ป่าไม้ทอง","7227222911","ขาย","2021-02-01","5","พนักงานขาย",null,"04-KR",null,"03-KB","เอมอร ลบศรี","พนักงานการเงิน","4",null,null,null,{"$f":"IFERROR(INDEX(Employee_Office[Employee Name],_xlfn.AGGREGATE(15,6,(ROW(Employee_Office[Branch])-ROW(Employee_Office[[#Headers],[Branch]]))/((Employee_Office[Branch]=SLBranch)*(Employee_Office[PosNum]=\"3\")),ROWS($5:6))),\"\")","v":""}]
[null,"101996","03-KB","1250200035947","นายสมพร เล็กสอน","7220389352","ขาย","2022-09-14","5","พนักงานขาย",null,"05-NP",null,"03-KB","นางสาวแสงตะวัน พรมภูผา","พนักงานการเงิน","4",null,null,null,{"$f":"IFERROR(INDEX(Employee_Office[Employee Name],_xlfn.AGGREGATE(15,6,(ROW(Employee_Office[Branch])-ROW(Employee_Office[[#Headers],[Branch]]))/((Employee_Office[Branch]=SLBranch)*(Employee_Office[PosNum]=\"3\")),ROWS($5:7))),\"\")","v":""}]
[null,"102428","03-KB","3250300165679","นายวัชรพล สิงห์ถา","7220087816","ขาย","2022-01-10","5","พนักงานขาย",null,"06-KK",null,"04-KR","ดวงพร กว้างนอก","พนักงานบัญชี","3",null,null,null,{"$f":"IFERROR(INDEX(Employee_Office[Employee Name],_xlfn.AGGREGATE(15,6,(ROW(Employee_Office[Branch])-ROW(Employee_Office[[#Headers],[Branch]]))/((Employee_Office[Branch]=SLBranch)*(Employee_Office[PosNum]=\"3\")),ROWS($5:8))),\"\")","v":""}]
[null,"104322","03-KB","3250200229098","นายขจรศักดิ์ บุพลับ(ทุจริต)","7227255705","ขาย","2023-03-08","5","พนักงานขาย",null,"07-AY",null,"04-KR","นางสาวสุคนธ์ เกิดมงคล","พนักงานการเงิน","4"]
[null,"104346","03-KB","1250300083820","นางสาวพัชรพร คำแก้ว","7227256141","ขาย","2023-03-13","5","พนักงานขาย",null,"08-BK",null,"04-KR","นางสาวพนิดา วรรณทอง","พนักงานการเงิน","4"]
[null,"104447","03-KB","1149900052649","นางสาวอรุณี จันทร์สมโภชน์","7220423839","ขาย","2023-04-06","5","พนักงานขาย",null,"09-RY",null,"05-NP","เบญจวรรณ พันยุโดด","พนักงานบัญชี","3"]
[null,"104494","03-KB","1130300086561","นายธนัชพร ใหม่อินทร์","7227258048","บริหาร","2023-04-18","5","พนักงานขาย",null,"10-SK",null,"05-NP","จรีพร พรหมศีรี","พนักงานการเงิน","4"]
[null,"104836","03-KB","1250200186481","นายจิโรจน์ งานไพโรจน์","7227260598","ขาย","2023-06-13","5","พนักงานขาย",null,"12-PY",null,"05-NP","นางสาวปวันนา เสร็จกิจ","พนักงานการเงิน","4"]
[null,"104915","03-KB","3250200232846","นายวิชัยพร อุ่นคำหิรัญนนท์(ทุจริต)","7227261133","ขาย","2023-06-28","5","พนักงานขาย",null,"13-SR",null,"06-KK","นางสาวสิรินยา สีถาพล","พนักงานบัญชี","3"]
[null,"104965","03-KB","1102002664631","นางสาววิสาพร ดียิ่ง","2855951246","ขาย","2023-07-06","5","พนักงานขาย",null,"14-CB",null,"06-KK","นางสาวสุชาดา จันทร์เจริญ","พนักงานการเงิน","4"]
[null,"105251","03-KB","1102001276548","นายศรีวิชัย วงษ์มิตร","7227264319","ขาย","2023-09-18","5","พนักงานขาย",null,"15-UB",null,"06-KK","นางสาวพลอยไพลิน สรสิทธิ์","พนักงานการเงิน","4"]
[null,"105415","03-KB","1259500075098","นายพิชิต ร่มสุกข์","9807893731","ขาย","2023-10-30","5","พนักงานขาย",null,"16-KL",null,"07-AY","ภัทราภรณ์ เสือคง","พนักงานบัญชี","3"]
[null,"105527","03-KB","1200100221722","นางสาวสุดาพร พนมมรรค","7220435312","ขาย","2023-12-07","5","พนักงานขาย",null,"17-LA",null,"07-AY","พนิดา ราชปละ","พนักงานการเงิน","4"]
[null,"105603","03-KB","1250400194968","นางสาวกุลนิภา สาธุชน","9807653135","ขาย","2024-01-03","5","พนักงานขาย",null,"18-SN",null,"07-AY","อัจฉรา พงษ์โสภึ","พนักงานการเงิน","4"]
[null,"100215","03-KB","3440800506414","สมพร จันทะนัน","7227222945","ขาย","2007-10-19","6","พนักงานช่วยขาย",null,"19-UD",null,"08-BK","นางสาวเกศรินทร์ อุทัยบาล","พนักงานบัญชี","3"]
{"$rows_left_out":666}
{"sheet":"TimeScanAtt","index":3,"n_rows":2158,"n_cols":12,"rows_kept":2158,"cut":false,"hidden":true,"merged":[[4,2,4,3],[1,2,1,8]]}
[]
[null,null,">>>  ฐานข้อมูลประมวลผลการสแกนนิ้วมือ (Time Attandance)"]
[null,"Web >>",{"$f":"\"http://ncsgoldbread.com/HR/Hr.php?date1=\"&$C$5&\"&date2=\"&$F$5","v":"http://ncsgoldbread.com/HR/Hr.php?date1=2024-01-08&date2=2024-01-14"}]
[]
[null,"ระหว่างวันที่",{"$f":"TEXT(StartDate,\"[$-409]yyyy-mm-dd\")","v":"2024-01-08"},null,"ถึง",{"$f":"TEXT(StartDate+6,\"[$-409]yyyy-mm-dd\")","v":"2024-01-14"}]
[]
[null,"Primary_ID","Branch","Scan","วันที่","การลงเวลา (วัน)","PosNum","CheckIn","CheckIn_Branch",null,"CheckIn","Primary_ID"]
[null,"101996","03-KB","KB","2024-01-08",1,"5","03-KB","03-KB",null,"03-KB","100184"]
[null,"104346","03-KB","KB","2024-01-08",1,"5","03-KB","03-KB",null,"03-KB","100215"]
[null,"104447","03-KB","KB","2024-01-08",1,"5","03-KB","03-KB",null,"03-KB","100396"]
[null,"101996","03-KB","KB","2024-01-11",1,"5","03-KB","03-KB",null,"03-KB","100461"]
[null,"104494","03-KB","KB","2024-01-08",1,"5","03-KB","03-KB",null,"03-KB","100510"]
[null,"105415","03-KB","KB","2024-01-09",1,"5","03-KB","03-KB",null,"03-KB","101126"]
[null,"104836","03-KB","KB","2024-01-08",1,"5","03-KB","03-KB",null,"03-KB","101893"]
[null,"102428","03-KB","KB","2024-01-08",1,"5","03-KB","03-KB",null,"03-KB","101996"]
[null,"104322","03-KB","KB","2024-01-08",1,"5","03-KB","03-KB",null,"03-KB","102428"]
[null,"101126","03-KB","KB","2024-01-08",1,"5","03-KB","03-KB",null,"03-KB","104322"]
[null,"104494","03-KB","KB","2024-01-11",1,"5","03-KB","03-KB",null,"03-KB","104346"]
[null,"104447","03-KB","KB","2024-01-11",1,"5","03-KB","03-KB",null,"03-KB","104447"]
[null,"104322","03-KB","KB","2024-01-09",1,"5","03-KB","03-KB",null,"03-KB","104494"]
{"$rows_left_out":2139}
{"sheet":"Report","index":4,"n_rows":76,"n_cols":31,"rows_kept":76,"cut":false,"hidden":false,"merged":[[72,3,72,4],[75,3,75,4],[5,17,6,17],[71,3,71,4],[73,3,73,4],[74,3,74,4],[71,11,71,14],[72,11,72,14],[73,11,73,14],[50,15,51,15],[50,16,51,16],[50,17,51,17],[48,2,48,4],[48,5,48,6],[47,1,47,18],[50,18,51,18],[5,20,5,21],[1,1,1,6],[5,15,6,15],[3,5,3,7],[3,9,3,11],[5,1,6,1],[5,12,6,12],[5,2,6,2],[1,7,1,11],[5,18,6,18],[5,3,6,3],[5,4,6,4],[5,16,6,16],[50,1,51,1],[50,2,51,2],[50,3,51,3],[50,4,51,4],[50,12,51,12]]}
[]
[null,">>> รายงานการสรุปเบี้ยเลี้ยงประจำสัปดาห์ สาขา :",null,null,null,null,null,{"$f":"INDEX(Branches[Thai_Name],bIndex)","v":"พนัสนิคม"},null,null,null,null,{"$f":"MID(SLBranch,FIND(\"-\",SLBranch)+1,10)","v":"PK"}]
[]
[null,null,null,null,"ระหว่างวันที่ :","2024-01-08",null,null,"-","2024-01-14",null,null,null,"จำนวนพนักงาน :",{"$f":"MAX($B$8:$B$47)+COUNTIF($C$53:$C$58,\"*?\")","v":0},null,null,{"$f":"ROWS(EmpID_Bybranch)","v":{"$error":"#N/A"}},null,null,null,null,null,"Export File :",{"$f":"SLBranch&\"_เบี้ยเลี้ยงสาขา\"&BranchName&\"_\"&TEXT(StartDate,\"[$-409]ddmmyyy\")","v":"33-PK_เบี้ยเลี้ยงสาขาพนัสนิคม_08012024"}]
[]
[null,"ลำดับ","Emp.ID","ชื่อ - สกุล","เลขบัญชี BBL",{"$f":"TEXT(F$7,\"[$-107041E]ddd\")","v":"จ."},{"$f":"TEXT(G$7,\"[$-107041E]ddd\")","v":"อ."},"พ.","พฤ.","ศ.","ส.","อา.","รวม","ตกเบิกรอบเก่า","กรณีพิเศษ","เหตุผล","รวมทั้งสิน","ตำแหน่งงาน","หมายเหตุ",null,"รายชื่อพนักงานฝ่ายขายทั้งหมด",null,null,"Date_Index","Branch","Emp.ID","กรณีพิเศษ","เหตุผล","Total","หมายเหตุ","รอตกเบิก"]
[null,null,null,null,null,{"$f":"StartDate+COLUMNS($F:F)-1","v":"2024-01-08"},{"$f":"StartDate+COLUMNS($F:G)-1","v":"2024-01-09"},{"$f":"StartDate+COLUMNS($F:H)-1","v":"2024-01-10"},{"$f":"StartDate+COLUMNS($F:I)-1","v":"2024-01-11"},{"$f":"StartDate+COLUMNS($F:J)-1","v":"2024-01-12"},{"$f":"StartDate+COLUMNS($F:K)-1","v":"2024-01-13"},{"$f":"StartDate+COLUMNS($F:L)-1","v":"2024-01-14"},null,"2024-01-01","(บาท)",null,null,null,null,null,"ID","Name",null,{"$f":"IF($C8=\"\",\"\",StartDate&\"|\"&SLBranch)","v":""},"-",{"$f":"StartDate","v":45299},{"$f":"EndDate","v":"2024-01-14"},{"$f":"TEXT(NOW(),\"[$-107041E]d mmm yyyy  hh:mm;@\")","v":"11 ม.ค. 2567  23:17"},{"$f":"PreDate","v":"2024-01-01"},{"$f":"TRIM(SUBSTITUTE(SUBSTITUTE(D73&\"|\"&L73,\"(\",\"\"),\")\",\"\"))","v":"|"},{"$f":"SUM($AE$8:$AE$58)","v":0}]
[null,{"$f":"IF(C8<>\"\",ROWS($8:8),\"\")","v":""},{"$f":"IFERROR(IF(ROWS($8:8)>ROWS(Att_IndexList),\"\",INDEX(Att_IndexList,ROWS($8:8))),\"\")","v":""},{"$f":"IF($C8=\"\",\"\",INDEX(Employee_Sales[Employee Name],MATCH(Report!C8,Employee_Sales[Primary_ID],0)))","v":""},{"$f":"BankAccount","v":""},{"$f":"iCal","v":""},{"$f":"iCal","v":""},{"$f":"iCal","v":""},{"$f":"iCal","v":""},{"$f":"iCal","v":""},{"$f":"iCal","v":""},{"$f":"iCal","v":""},{"$f":"iTotal","v":""},{"$f":"iBackPay","v":""},null,null,{"$f":"iGrandTotal","v":""},{"$f":"iPosition","v":""},null,null,{"$f":"IFERROR(INDEX(Emp_DatabyBranch,ROWS($8:8),1),\"\")","v":""},{"$f":"IFERROR(INDEX(Emp_DatabyBranch,ROWS($8:8),4),\"\")","v":""},null,{"$f":"IF($Y8=\"\",\"\",StartDate&\"|\"&$Y8)","v":""},{"$f":"IF(OR($C8=\"\",NOT(ISNUMBER(--$C8))),\"\",SLBranch)","v":""},{"$f":"IF($Y8=\"\",\"\",$C8)","v":""},{"$f":"IF($Y8=\"\",\"\",$O8)","v":""},{"$f":"IF(OR($Y8=\"\",$P8=\"\"),\"\",$P8)","v":""},{"$f":"IF(AND(ISNUMBER($Q8),$AE8=\"\"),$Q8,\"\")","v":""},{"$f":"IF($Y8=\"\",\"\",\"\"&$S8&IF(AND(LEFT(P8,2)=\"2)\",SLBranch<>SelBranch),\" |\"&SLBranch,\"\"))","v":""},{"$f":"IF($Y8=\"\",\"\",IF(LEN(TRIM($E8))<>10,$Q8,\"\"))","v":""}]
[null,{"$f":"IF(C9<>\"\",ROWS($8:9),\"\")","v":""},{"$f":"IFERROR(IF(ROWS($8:9)>ROWS(Att_IndexList),\"\",INDEX(Att_IndexList,ROWS($8:9))),\"\")","v":""},{"$f":"IF($C9=\"\",\"\",INDEX(Employee_Sales[Employee Name],MATCH(Report!C9,Employee_Sales[Primary_ID],0)))","v":""},{"$f":"BankAccount","v":""},{"$f":"iCal","v":""},{"$f":"iCal","v":""},{"$f":"iCal","v":""},{"$f":"iCal","v":""},{"$f":"iCal","v":""},{"$f":"iCal","v":""},{"$f":"iCal","v":""},"",{"$f":"iBackPay","v":""},null,null,{"$f":"iGrandTotal","v":""},{"$f":"iPosition","v":""},null,null,{"$f":"IFERROR(INDEX(Emp_DatabyBranch,ROWS($8:9),1),\"\")","v":""},{"$f":"IFERROR(INDEX(Emp_DatabyBranch,ROWS($8:9),4),\"\")","v":""},null,"",{"$f":"IF(OR($C9=\"\",NOT(ISNUMBER(--$C9))),\"\",SLBranch)","v":""},"","","",{"$f":"IF(AND(ISNUMBER($Q9),$AE9=\"\"),$Q9,\"\")","v":""},{"$f":"IF($Y9=\"\",\"\",\"\"&$S9&IF(AND(LEFT(P9,2)=\"2)\",SLBranch<>SelBranch),\" |\"&SLBranch,\"\"))","v":""},""]
[null,{"$f":"IF(C10<>\"\",ROWS($8:10),\"\")","v":""},{"$f":"IFERROR(IF(ROWS($8:10)>ROWS(Att_IndexList),\"\",INDEX(Att_IndexList,ROWS($8:10))),\"\")","v":""},{"$f":"IF($C10=\"\",\"\",INDEX(Employee_Sales[Employee Name],MATCH(Report!C10,Employee_Sales[Primary_ID],0)))","v":""},{"$f":"BankAccount","v":""},{"$f":"iCal","v":""},{"$f":"iCal","v":""},{"$f":"iCal","v":""},{"$f":"iCal","v":""},{"$f":"iCal","v":""},{"$f":"iCal","v":""},{"$f":"iCal","v":""},"",{"$f":"iBackPay","v":""},null,null,{"$f":"iGrandTotal","v":""},{"$f":"iPosition","v":""},null,null,{"$f":"IFERROR(INDEX(Emp_DatabyBranch,ROWS($8:10),1),\"\")","v":""},{"$f":"IFERROR(INDEX(Emp_DatabyBranch,ROWS($8:10),4),\"\")","v":""},null,"",{"$f":"IF(OR($C10=\"\",NOT(ISNUMBER(--$C10))),\"\",SLBranch)","v":""},"","","","",{"$f":"IF($Y10=\"\",\"\",\"\"&$S10&IF(AND(LEFT(P10,2)=\"2)\",SLBranch<>SelBranch),\" |\"&SLBranch,\"\"))","v":""},""]
[null,{"$f":"IF(C11<>\"\",ROWS($8:11),\"\")","v":""},{"$f":"IFERROR(IF(ROWS($8:11)>ROWS(Att_IndexList),\"\",INDEX(Att_IndexList,ROWS($8:11))),\"\")","v":""},{"$f":"IF($C11=\"\",\"\",INDEX(Employee_Sales[Employee Name],MATCH(Report!C11,Employee_Sales[Primary_ID],0)))","v":""},{"$f":"BankAccount","v":""},{"$f":"iCal","v":""},{"$f":"iCal","v":""},{"$f":"iCal","v":""},{"$f":"iCal","v":""},{"$f":"iCal","v":""},{"$f":"iCal","v":""},{"$f":"iCal","v":""},"",{"$f":"iBackPay","v":""},null,null,{"$f":"iGrandTotal","v":""},{"$f":"iPosition","v":""},null,null,{"$f":"IFERROR(INDEX(Emp_DatabyBranch,ROWS($8:11),1),\"\")","v":""},{"$f":"IFERROR(INDEX(Emp_DatabyBranch,ROWS($8:11),4),\"\")","v":""},null,"",{"$f":"IF(OR($C11=\"\",NOT(ISNUMBER(--$C11))),\"\",SLBranch)","v":""},"","","","",{"$f":"IF($Y11=\"\",\"\",\"\"&$S11&IF(AND(LEFT(P11,2)=\"2)\",SLBranch<>SelBranch),\" |\"&SLBranch,\"\"))","v":""},""]
[null,{"$f":"IF(C12<>\"\",ROWS($8:12),\"\")","v":""},{"$f":"IFERROR(IF(ROWS($8:12)>ROWS(Att_IndexList),\"\",INDEX(Att_IndexList,ROWS($8:12))),\"\")","v":""},{"$f":"IF($C12=\"\",\"\",INDEX(Employee_Sales[Employee Name],MATCH(Report!C12,Employee_Sales[Primary_ID],0)))","v":""},{"$f":"BankAccount","v":""},{"$f":"iCal","v":""},{"$f":"iCal","v":""},{"$f":"iCal","v":""},{"$f":"iCal","v":""},{"$f":"iCal","v":""},{"$f":"iCal","v":""},{"$f":"iCal","v":""},"",{"$f":"iBackPay","v":""},null,null,{"$f":"iGrandTotal","v":""},{"$f":"iPosition","v":""},null,null,{"$f":"IFERROR(INDEX(Emp_DatabyBranch,ROWS($8:12),1),\"\")","v":""},{"$f":"IFERROR(INDEX(Emp_DatabyBranch,ROWS($8:12),4),\"\")","v":""},null,"",{"$f":"IF(OR($C12=\"\",NOT(ISNUMBER(--$C12))),\"\",SLBranch)","v":""},"","","","",{"$f":"IF($Y12=\"\",\"\",\"\"&$S12&IF(AND(LEFT(P12,2)=\"2)\",SLBranch<>SelBranch),\" |\"&SLBranch,\"\"))","v":""},""]
[null,{"$f":"IF(C13<>\"\",ROWS($8:13),\"\")","v":""},{"$f":"IFERROR(IF(ROWS($8:13)>ROWS(Att_IndexList),\"\",INDEX(Att_IndexList,ROWS($8:13))),\"\")","v":""},{"$f":"IF($C13=\"\",\"\",INDEX(Employee_Sales[Employee Name],MATCH(Report!C13,Employee_Sales[Primary_ID],0)))","v":""},{"$f":"BankAccount","v":""},{"$f":"iCal","v":""},{"$f":"iCal","v":""},{"$f":"iCal","v":""},{"$f":"iCal","v":""},{"$f":"iCal","v":""},{"$f":"iCal","v":""},{"$f":"iCal","v":""},"",{"$f":"iBackPay","v":""},null,null,{"$f":"iGrandTotal","v":""},{"$f":"iPosition","v":""},null,null,{"$f":"IFERROR(INDEX(Emp_DatabyBranch,ROWS($8:13),1),\"\")","v":""},{"$f":"IFERROR(INDEX(Emp_DatabyBranch,ROWS($8:13),4),\"\")","v":""},null,"",{"$f":"IF(OR($C13=\"\",NOT(ISNUMBER(--$C13))),\"\",SLBranch)","v":""},"","","","",{"$f":"IF($Y13=\"\",\"\",\"\"&$S13&IF(AND(LEFT(P13,2)=\"2)\",SLBranch<>SelBranch),\" |\"&SLBranch,\"\"))","v":""},""]
[null,{"$f":"IF(C14<>\"\",ROWS($8:14),\"\")","v":""},{"$f":"IFERROR(IF(ROWS($8:14)>ROWS(Att_IndexList),\"\",INDEX(Att_IndexList,ROWS($8:14))),\"\")","v":""},{"$f":"IF($C14=\"\",\"\",INDEX(Employee_Sales[Employee Name],MATCH(Report!C14,Employee_Sales[Primary_ID],0)))","v":""},{"$f":"BankAccount","v":""},{"$f":"iCal","v":""},{"$f":"iCal","v":""},{"$f":"iCal","v":""},{"$f":"iCal","v":""},{"$f":"iCal","v":""},{"$f":"iCal","v":""},{"$f":"iCal","v":""},"",{"$f":"iBackPay","v":""},null,null,{"$f":"iGrandTotal","v":""},{"$f":"iPosition","v":""},null,null,{"$f":"IFERROR(INDEX(Emp_DatabyBranch,ROWS($8:14),1),\"\")","v":""},{"$f":"IFERROR(INDEX(Emp_DatabyBranch,ROWS($8:14),4),\"\")","v":""},null,"",{"$f":"IF(OR($C14=\"\",NOT(ISNUMBER(--$C14))),\"\",SLBranch)","v":""},"","","","",{"$f":"IF($Y14=\"\",\"\",\"\"&$S14&IF(AND(LEFT(P14,2)=\"2)\",SLBranch<>SelBranch),\" |\"&SLBranch,\"\"))","v":""},""]
[null,{"$f":"IF(C15<>\"\",ROWS($8:15),\"\")","v":""},{"$f":"IFERROR(IF(ROWS($8:15)>ROWS(Att_IndexList),\"\",INDEX(Att_IndexList,ROWS($8:15))),\"\")","v":""},{"$f":"IF($C15=\"\",\"\",INDEX(Employee_Sales[Employee Name],MATCH(Report!C15,Employee_Sales[Primary_ID],0)))","v":""},{"$f":"BankAccount","v":""},{"$f":"iCal","v":""},{"$f":"iCal","v":""},{"$f":"iCal","v":""},{"$f":"iCal","v":""},{"$f":"iCal","v":""},{"$f":"iCal","v":""},{"$f":"iCal","v":""},"",{"$f":"iBackPay","v":""},null,null,{"$f":"iGrandTotal","v":""},{"$f":"iPosition","v":""},null,null,{"$f":"IFERROR(INDEX(Emp_DatabyBranch,ROWS($8:15),1),\"\")","v":""},{"$f":"IFERROR(INDEX(Emp_DatabyBranch,ROWS($8:15),4),\"\")","v":""},null,"",{"$f":"IF(OR($C15=\"\",NOT(ISNUMBER(--$C15))),\"\",SLBranch)","v":""},"","","","",{"$f":"IF($Y15=\"\",\"\",\"\"&$S15&IF(AND(LEFT(P15,2)=\"2)\",SLBranch<>SelBranch),\" |\"&SLBranch,\"\"))","v":""},""]
[null,{"$f":"IF(C16<>\"\",ROWS($8:16),\"\")","v":""},{"$f":"IFERROR(IF(ROWS($8:16)>ROWS(Att_IndexList),\"\",INDEX(Att_IndexList,ROWS($8:16))),\"\")","v":""},{"$f":"IF($C16=\"\",\"\",INDEX(Employee_Sales[Employee Name],MATCH(Report!C16,Employee_Sales[Primary_ID],0)))","v":""},{"$f":"BankAccount","v":""},{"$f":"iCal","v":""},{"$f":"iCal","v":""},{"$f":"iCal","v":""},{"$f":"iCal","v":""},{"$f":"iCal","v":""},{"$f":"iCal","v":""},{"$f":"iCal","v":""},"",{"$f":"iBackPay","v":""},null,null,{"$f":"iGrandTotal","v":""},{"$f":"iPosition","v":""},null,null,{"$f":"IFERROR(INDEX(Emp_DatabyBranch,ROWS($8:16),1),\"\")","v":""},{"$f":"IFERROR(INDEX(Emp_DatabyBranch,ROWS($8:16),4),\"\")","v":""},null,"",{"$f":"IF(OR($C16=\"\",NOT(ISNUMBER(--$C16))),\"\",SLBranch)","v":""},"","","","",{"$f":"IF($Y16=\"\",\"\",\"\"&$S16&IF(AND(LEFT(P16,2)=\"2)\",SLBranch<>SelBranch),\" |\"&SLBranch,\"\"))","v":""},""]
[null,{"$f":"IF(C17<>\"\",ROWS($8:17),\"\")","v":""},{"$f":"IFERROR(IF(ROWS($8:17)>ROWS(Att_IndexList),\"\",INDEX(Att_IndexList,ROWS($8:17))),\"\")","v":""},{"$f":"IF($C17=\"\",\"\",INDEX(Employee_Sales[Employee Name],MATCH(Report!C17,Employee_Sales[Primary_ID],0)))","v":""},{"$f":"BankAccount","v":""},{"$f":"iCal","v":""},{"$f":"iCal","v":""},{"$f":"iCal","v":""},{"$f":"iCal","v":""},{"$f":"iCal","v":""},{"$f":"iCal","v":""},{"$f":"iCal","v":""},"",{"$f":"iBackPay","v":""},null,null,{"$f":"iGrandTotal","v":""},{"$f":"iPosition","v":""},null,null,{"$f":"IFERROR(INDEX(Emp_DatabyBranch,ROWS($8:17),1),\"\")","v":""},{"$f":"IFERROR(INDEX(Emp_DatabyBranch,ROWS($8:17),4),\"\")","v":""},null,"",{"$f":"IF(OR($C17=\"\",NOT(ISNUMBER(--$C17))),\"\",SLBranch)","v":""},"","","","",{"$f":"IF($Y17=\"\",\"\",\"\"&$S17&IF(AND(LEFT(P17,2)=\"2)\",SLBranch<>SelBranch),\" |\"&SLBranch,\"\"))","v":""},""]
[null,{"$f":"IF(C18<>\"\",ROWS($8:18),\"\")","v":""},{"$f":"IFERROR(IF(ROWS($8:18)>ROWS(Att_IndexList),\"\",INDEX(Att_IndexList,ROWS($8:18))),\"\")","v":""},{"$f":"IF($C18=\"\",\"\",INDEX(Employee_Sales[Employee Name],MATCH(Report!C18,Employee_Sales[Primary_ID],0)))","v":""},{"$f":"BankAccount","v":""},{"$f":"iCal","v":""},{"$f":"iCal","v":""},{"$f":"iCal","v":""},{"$f":"iCal","v":""},{"$f":"iCal","v":""},{"$f":"iCal","v":""},{"$f":"iCal","v":""},"",{"$f":"iBackPay","v":""},null,null,{"$f":"iGrandTotal","v":""},{"$f":"iPosition","v":""},null,null,{"$f":"IFERROR(INDEX(Emp_DatabyBranch,ROWS($8:18),1),\"\")","v":""},{"$f":"IFERROR(INDEX(Emp_DatabyBranch,ROWS($8:18),4),\"\")","v":""},null,"",{"$f":"IF(OR($C18=\"\",NOT(ISNUMBER(--$C18))),\"\",SLBranch)","v":""},"","","","",{"$f":"IF($Y18=\"\",\"\",\"\"&$S18&IF(AND(LEFT(P18,2)=\"2)\",SLBranch<>SelBranch),\" |\"&SLBranch,\"\"))","v":""},""]
[null,{"$f":"IF(C19<>\"\",ROWS($8:19),\"\")","v":""},{"$f":"IFERROR(IF(ROWS($8:19)>ROWS(Att_IndexList),\"\",INDEX(Att_IndexList,ROWS($8:19))),\"\")","v":""},{"$f":"IF($C19=\"\",\"\",INDEX(Employee_Sales[Employee Name],MATCH(Report!C19,Employee_Sales[Primary_ID],0)))","v":""},{"$f":"BankAccount","v":""},{"$f":"iCal","v":""},{"$f":"iCal","v":""},{"$f":"iCal","v":""},{"$f":"iCal","v":""},{"$f":"iCal","v":""},{"$f":"iCal","v":""},{"$f":"iCal","v":""},"",{"$f":"iBackPay","v":""},null,null,{"$f":"iGrandTotal","v":""},{"$f":"iPosition","v":""},null,null,{"$f":"IFERROR(INDEX(Emp_DatabyBranch,ROWS($8:19),1),\"\")","v":""},{"$f":"IFERROR(INDEX(Emp_DatabyBranch,ROWS($8:19),4),\"\")","v":""},null,"",{"$f":"IF(OR($C19=\"\",NOT(ISNUMBER(--$C19))),\"\",SLBranch)","v":""},"","","","",{"$f":"IF($Y19=\"\",\"\",\"\"&$S19&IF(AND(LEFT(P19,2)=\"2)\",SLBranch<>SelBranch),\" |\"&SLBranch,\"\"))","v":""},""]
[null,{"$f":"IF(C20<>\"\",ROWS($8:20),\"\")","v":""},{"$f":"IFERROR(IF(ROWS($8:20)>ROWS(Att_IndexList),\"\",INDEX(Att_IndexList,ROWS($8:20))),\"\")","v":""},{"$f":"IF($C20=\"\",\"\",INDEX(Employee_Sales[Employee Name],MATCH(Report!C20,Employee_Sales[Primary_ID],0)))","v":""},{"$f":"BankAccount","v":""},{"$f":"iCal","v":""},{"$f":"iCal","v":""},{"$f":"iCal","v":""},{"$f":"iCal","v":""},{"$f":"iCal","v":""},{"$f":"iCal","v":""},{"$f":"iCal","v":""},"",{"$f":"iBackPay","v":""},null,null,{"$f":"iGrandTotal","v":""},{"$f":"iPosition","v":""},null,null,{"$f":"IFERROR(INDEX(Emp_DatabyBranch,ROWS($8:20),1),\"\")","v":""},{"$f":"IFERROR(INDEX(Emp_DatabyBranch,ROWS($8:20),4),\"\")","v":""},null,"",{"$f":"IF(OR($C20=\"\",NOT(ISNUMBER(--$C20))),\"\",SLBranch)","v":""},"","","","",{"$f":"IF($Y20=\"\",\"\",\"\"&$S20&IF(AND(LEFT(P20,2)=\"2)\",SLBranch<>SelBranch),\" |\"&SLBranch,\"\"))","v":""},""]
{"$rows_left_out":56}